Target
Vesicular acetylcholine transporter
Ligand
BDBM50338990
Substrate
Meas. Tech.
ChEMBL_949957 (CHEMBL2352312)
Ki
50±n/a nM
Citation
 Li, YWang, XZhang, JDeuther-Conrad, WXie, FZhang, XLiu, JQiao, JCui, MSteinbach, JBrust, PLiu, BJia, H Synthesis and evaluation of novel (18)F-labeled spirocyclic piperidine derivatives ass1 receptor ligands for positron emission tomography imaging. J Med Chem 56:3478-91 (2013)  
Target
Name:
Vesicular acetylcholine transporter
Synonyms:
Slc18a3 VACHT_RAT Vat | rVAT
Type:
PROTEIN
Mol. Mass.:
56533.41
Organism:
Rattus norvegicus
Description:
ChEMBL_1503353
Residue:
530
  
Inhibitor
Name:
BDBM50338990
Synonyms:
1-(3,4-dimethoxyphenethyl)-4-(3-phenylpropyl)piperazine CHEMBL408867 | N-phenylpropyl-N''-3,4-dimethoxyphenethyl piperazine
Type:
Small organic molecule
Emp. Form.:
C23H32N2O2
Mol. Mass.:
368.5124
SMILES:
COc1ccc(CCN2CCN(CCCc3ccccc3)CC2)cc1OC
: