Target
Myeloperoxidase
Ligand
BDBM50432585
Substrate
Meas. Tech.
ChEMBL_950696 (CHEMBL2352939)
IC50
44±n/a nM
Citation
 Soubhye, JAldib, IElfving, BGelbcke, MFurtmüller, PGPodrecca, MConotte, RColet, JMRousseau, AReye, FSarakbi, AVanhaeverbeek, MKauffmann, JMObinger, CNève, JPrévost, MZouaoui Boudjeltia, KDufrasne, FVan Antwerpen, P Design, synthesis, and structure-activity relationship studies of novel 3-alkylindole derivatives as selective and highly potent myeloperoxidase inhibitors. J Med Chem 56:3943-58 (2013)  
Target
Name:
Myeloperoxidase
Synonyms:
84 kDa myeloperoxidase MPO Myeloperoxidase Myeloperoxidase heavy chain PERM_HUMAN
Type:
Enzyme
Mol. Mass.:
83888.32
Organism:
Homo sapiens (Human)
Description:
P05164
Residue:
745
  
Inhibitor
Name:
BDBM50432585
Synonyms:
CHEMBL2347027
Type:
Small organic molecule
Emp. Form.:
C13H15FN2O
Mol. Mass.:
234.2694
SMILES:
NC(=O)CCCCc1c[nH]c2c(F)cccc12
: