Target
Myeloperoxidase
Ligand
BDBM50432565
Substrate
Meas. Tech.
ChEMBL_950696 (CHEMBL2352939)
IC50
18±n/a nM
Citation
 Soubhye, JAldib, IElfving, BGelbcke, MFurtmüller, PGPodrecca, MConotte, RColet, JMRousseau, AReye, FSarakbi, AVanhaeverbeek, MKauffmann, JMObinger, CNève, JPrévost, MZouaoui Boudjeltia, KDufrasne, FVan Antwerpen, P Design, synthesis, and structure-activity relationship studies of novel 3-alkylindole derivatives as selective and highly potent myeloperoxidase inhibitors. J Med Chem 56:3943-58 (2013)  
Target
Name:
Myeloperoxidase
Synonyms:
84 kDa myeloperoxidase MPO Myeloperoxidase Myeloperoxidase heavy chain PERM_HUMAN
Type:
Enzyme
Mol. Mass.:
83888.32
Organism:
Homo sapiens (Human)
Description:
P05164
Residue:
745
  
Inhibitor
Name:
BDBM50432565
Synonyms:
CHEMBL2347181
Type:
Small organic molecule
Emp. Form.:
C12H13FN2O
Mol. Mass.:
220.2428
SMILES:
NC(=O)CCCc1c[nH]c2ccc(F)cc12
: