Target
Beta-secretase 2
Ligand
BDBM50432611
Substrate
Meas. Tech.
ChEMBL_950723 (CHEMBL2353184)
IC50
18±n/a nM
Citation
 Hilpert, HGuba, WWoltering, TJWostl, WPinard, EMauser, HMayweg, AVRogers-Evans, MHumm, RKrummenacher, DMuser, TSchnider, CJacobsen, HOzmen, LBergadano, ABanner, DWHochstrasser, RKuglstatter, ADavid-Pierson, PFischer, HPolara, ANarquizian, R ß-Secretase (BACE1) inhibitors with high in vivo efficacy suitable for clinical evaluation in Alzheimer's disease. J Med Chem 56:3980-95 (2013)  
Target
Name:
Beta-secretase 2
Synonyms:
AEPLC ASP1 Asp 1 Aspartyl protease 1 BACE2_HUMAN Beta-secretase (BACE) Beta-secretase 2 (BACE-2) Beta-site APP-cleaving enzyme 2 Memapsin-1 beta-Secretase (BACE-2)
Type:
Protein
Mol. Mass.:
56171.20
Organism:
Homo sapiens (Human)
Description:
Q9Y5Z0
Residue:
518
  
Inhibitor
Name:
BDBM50432611
Synonyms:
CHEMBL2347201
Type:
Small organic molecule
Emp. Form.:
C16H14F5N5O2
Mol. Mass.:
403.3067
SMILES:
C[C@@]1(N=C(N)OCC1(F)F)c1cc(NC(=O)c2ccn(n2)C(F)F)ccc1F
: