Target
Beta-1 adrenergic receptor
Ligand
BDBM50432701
Substrate
Meas. Tech.
ChEMBL_952279 (CHEMBL2351585)
Kd
1.5±n/a nM
Citation
 Mistry, SNBaker, JGFischer, PMHill, SJGardiner, SMKellam, B Synthesis and in vitro and in vivo characterization of highlyß1-selectiveß-adrenoceptor partial agonists. J Med Chem 56:3852-65 (2013)  
Target
Name:
Beta-1 adrenergic receptor
Synonyms:
ADRB1 ADRB1_HUMAN Beta-1 adrenoceptor | adrenergic Beta1
Type:
G Protein-Coupled Receptor (GPCR)
Mol. Mass.:
51338.40
Organism:
Homo sapiens (Human)
Description:
P08588
Residue:
477
  
Inhibitor
Name:
BDBM50432701
Synonyms:
CHEMBL2348201
Type:
Small organic molecule
Emp. Form.:
C25H34ClN3O5
Mol. Mass.:
492.008
SMILES:
OC(CNCCNC(=O)Nc1cccc(Cl)c1)COc1ccc(OCCOC2CCCC2)cc1
: