Target
Beta-1 adrenergic receptor
Ligand
BDBM50027884
Substrate
Meas. Tech.
ChEMBL_952282 (CHEMBL2351861)
Kd
12±n/a nM
Citation
 Mistry, SNBaker, JGFischer, PMHill, SJGardiner, SMKellam, B Synthesis and in vitro and in vivo characterization of highlyß1-selectiveß-adrenoceptor partial agonists. J Med Chem 56:3852-65 (2013)  
Target
Name:
Beta-1 adrenergic receptor
Synonyms:
ADRB1 ADRB1_HUMAN Beta-1 adrenoceptor | adrenergic Beta1
Type:
G Protein-Coupled Receptor (GPCR)
Mol. Mass.:
51338.40
Organism:
Homo sapiens (Human)
Description:
P08588
Residue:
477
  
Inhibitor
Name:
BDBM50027884
Synonyms:
CHEMBL2348204
Type:
Small organic molecule
Emp. Form.:
C25H34BrN3O5
Mol. Mass.:
536.459
SMILES:
OC(CNCCNC(=O)Nc1cccc(Br)c1)COc1ccc(OCCOC2CCCC2)cc1
: