Target
Peptidyl-prolyl cis-trans isomerase FKBP5
Ligand
BDBM50432745
Substrate
Meas. Tech.
ChEMBL_952910 (CHEMBL2351899)
Ki
2100±n/a nM
Citation
 Wang, YKirschner, AFabian, AKGopalakrishnan, RKress, CHoogeland, BKoch, UKozany, CBracher, AHausch, F Increasing the efficiency of ligands for FK506-binding protein 51 by conformational control. J Med Chem 56:3922-35 (2013)  
Target
Name:
Peptidyl-prolyl cis-trans isomerase FKBP5
Synonyms:
51 kDa FK506-binding protein 54 kDa progesterone receptor-associated immunophilin Androgen-regulated protein 6 FK506-binding protein 5 FKBP-51 FKBP51 FKBP5_HUMAN PPIase FKBP5 p54
Type:
PROTEIN
Mol. Mass.:
51207.06
Organism:
Homo sapiens (Human)
Description:
ChEMBL_952910
Residue:
457
  
Inhibitor
Name:
BDBM50432745
Synonyms:
CHEMBL2348591
Type:
Small organic molecule
Emp. Form.:
C25H29N3O6S2
Mol. Mass.:
531.644
SMILES:
COc1ccc(OCCN2CCC3CCCC(N3S(=O)(=O)c3ccc4ncsc4c3)C2=O)cc1OC
: