Target
Baculoviral IAP repeat-containing protein 3
Ligand
BDBM50432755
Substrate
Meas. Tech.
ChEMBL_952936 (CHEMBL2351925)
Ki
13±n/a nM
Citation
 Sheng, RSun, HLiu, LLu, JMcEachern, DWang, GWen, JMin, PDu, ZLu, HKang, SGuo, MYang, DWang, S A potent bivalent Smac mimetic (SM-1200) achieving rapid, complete, and durable tumor regression in mice. J Med Chem 56:3969-79 (2013)  
Target
Name:
Baculoviral IAP repeat-containing protein 3
Synonyms:
API2 BIRC3_HUMAN Baculoviral IAP repeat-containing protein 3 (IAP1 BIR3) MIHC XIAP-BIR3 | cIAP1/cIAP2
Type:
Protein
Mol. Mass.:
68365.75
Organism:
Homo sapiens (Human)
Description:
Q13489
Residue:
604
  
Inhibitor
Name:
BDBM50432755
Synonyms:
CHEMBL2348615
Type:
Small organic molecule
Emp. Form.:
C64H86N12O8
Mol. Mass.:
1151.4432
SMILES:
CN[C@@H](C)C(=O)N[C@H]1CN(CC[C@H]2CC[C@H](N2C1=O)C(=O)NC(c1ccccc1)c1ccccc1)C(=O)NCCCCCCCCNC(=O)N1CC[C@H]2CC[C@H](N2C(=O)[C@H](C1)NC(=O)[C@H](C)NC)C(=O)NC(c1ccccc1)c1ccccc1
: