Target
Inosine-5'-monophosphate dehydrogenase 2
Ligand
BDBM50432791
Substrate
Meas. Tech.
ChEMBL_953210 (CHEMBL2353885)
IC50
>5000±n/a nM
Citation
 Gorla, SKKavitha, MZhang, MChin, JELiu, XStriepen, BMakowska-Grzyska, MKim, YJoachimiak, AHedstrom, LCuny, GD Optimization of benzoxazole-based inhibitors of Cryptosporidium parvum inosine 5'-monophosphate dehydrogenase. J Med Chem 56:4028-43 (2013)  
Target
Name:
Inosine-5'-monophosphate dehydrogenase 2
Synonyms:
IMDH2_HUMAN IMPD 2 IMPDH-II Inosine 5'-monophosphate dehydrogenase II (IMPDH II) Inosine-5 -monophosphate dehydrogenase 2 | Inosine-5'-monophosphate dehydrogenase (IMPDH)
Type:
Enzyme
Mol. Mass.:
55806.87
Organism:
Homo sapiens (Human)
Description:
Recombinant IMPDH2 expressed in E. coli.
Residue:
514
  
Inhibitor
Name:
BDBM50432791
Synonyms:
CHEMBL2348823
Type:
Small organic molecule
Emp. Form.:
C25H19N3O3
Mol. Mass.:
409.4367
SMILES:
C[C@H](Oc1cccc2ccccc12)C(=O)Nc1ccc2oc(nc2c1)-c1ccncc1
: