Target
Inosine-5'-monophosphate dehydrogenase
Ligand
BDBM50432783
Substrate
Meas. Tech.
ChEMBL_953212 (CHEMBL2354115)
IC50
1.4±n/a nM
Citation
 Gorla, SKKavitha, MZhang, MChin, JELiu, XStriepen, BMakowska-Grzyska, MKim, YJoachimiak, AHedstrom, LCuny, GD Optimization of benzoxazole-based inhibitors of Cryptosporidium parvum inosine 5'-monophosphate dehydrogenase. J Med Chem 56:4028-43 (2013)  
Target
Name:
Inosine-5'-monophosphate dehydrogenase
Synonyms:
Cgd6_20 protein Inosine-5'-monophosphate dehydrogenase, probable | Inosine-5-monophosphate dehydrogenase (IMPDH)
Type:
Protein
Mol. Mass.:
43076.80
Organism:
Cryptosporidium parvum
Description:
Q8T6T2
Residue:
400
  
Inhibitor
Name:
BDBM50432783
Synonyms:
CHEMBL2348803
Type:
Small organic molecule
Emp. Form.:
C19H13Cl2N3O3S
Mol. Mass.:
434.296
SMILES:
C[C@H](Oc1cccc(Cl)c1Cl)C(=O)Nc1ccc2oc(nc2c1)-c1cncs1
: