Target
Inosine-5'-monophosphate dehydrogenase
Ligand
BDBM50432787
Substrate
Meas. Tech.
ChEMBL_953212 (CHEMBL2354115)
IC50
50±n/a nM
Citation
 Gorla, SKKavitha, MZhang, MChin, JELiu, XStriepen, BMakowska-Grzyska, MKim, YJoachimiak, AHedstrom, LCuny, GD Optimization of benzoxazole-based inhibitors of Cryptosporidium parvum inosine 5'-monophosphate dehydrogenase. J Med Chem 56:4028-43 (2013)  
Target
Name:
Inosine-5'-monophosphate dehydrogenase
Synonyms:
Cgd6_20 protein Inosine-5'-monophosphate dehydrogenase, probable | Inosine-5-monophosphate dehydrogenase (IMPDH)
Type:
Protein
Mol. Mass.:
43076.80
Organism:
Cryptosporidium parvum
Description:
Q8T6T2
Residue:
400
  
Inhibitor
Name:
BDBM50432787
Synonyms:
CHEMBL2348799
Type:
Small organic molecule
Emp. Form.:
C23H21N3O5
Mol. Mass.:
419.4299
SMILES:
COc1cccc(O[C@@H](C)C(=O)Nc2ccc3oc(nc3c2)-c2ccncc2)c1OC
: