Target
Dihydrofolate reductase
Ligand
BDBM50432810
Substrate
Meas. Tech.
ChEMBL_956187 (CHEMBL2379281)
IC50
500±n/a nM
Citation
 Al-Omary, FAHassan, GSEl-Messery, SMNagi, MNHabib, el-SEEl-Subbagh, HI Nonclassical antifolates, part 3: synthesis, biological evaluation and molecular modeling study of some new 2-heteroarylthio-quinazolin-4-ones. Eur J Med Chem 63:33-45 (2013)  
Target
Name:
Dihydrofolate reductase
Synonyms:
DHFR Dihydrofolate reductase | Dihydrofolate reductase (DHFR)
Type:
Enzyme
Mol. Mass.:
21603.71
Organism:
Bos taurus (Cattle)
Description:
P00376
Residue:
187
  
Inhibitor
Name:
BDBM50432810
Synonyms:
CHEMBL2376069
Type:
Small organic molecule
Emp. Form.:
C19H16N4O3S2
Mol. Mass.:
412.485
SMILES:
COc1cc2nc(Sc3cnc(N)s3)n(-c3ccccc3)c(=O)c2cc1OC
: