Target
Hepatocyte growth factor receptor
Ligand
BDBM50432891
Substrate
Meas. Tech.
ChEMBL_956507 (CHEMBL2379920)
IC50
31±n/a nM
Citation
 Zhang, DAi, JLiang, ZZhu, WPeng, XChen, XJi, YJiang, HLuo, CGeng, MLiu, H Novel 5-(benzyloxy)pyridin-2(1H)-one derivatives as potent c-Met inhibitors. Bioorg Med Chem Lett 23:2408-13 (2013)  
Target
Name:
Hepatocyte growth factor receptor
Synonyms:
Hepatocyte growth factor receptor Hepatocyte growth factor receptor (c-MET) MET Met proto-oncogene (hepatocyte growth factor receptor) Tyrosine-protein kinase Met (c-Met) c-Met kinase
Type:
Protein
Mol. Mass.:
155559.73
Organism:
Homo sapiens (Human)
Description:
P08581
Residue:
1390
  
Inhibitor
Name:
BDBM50432891
Synonyms:
CHEMBL2376651
Type:
Small organic molecule
Emp. Form.:
C24H24Cl2FN5O3
Mol. Mass.:
520.383
SMILES:
C[C@@H](Oc1c[nH]c(=O)c(c1)C(=O)Nc1ccc(nc1)N1CCN(C)CC1)c1c(Cl)ccc(F)c1Cl
: