Target
11-beta-hydroxysteroid dehydrogenase 1
Ligand
BDBM50432940
Substrate
Meas. Tech.
ChEMBL_957421 (CHEMBL2378091)
EC50
21±n/a nM
Citation
 Nair, SKMatthews, JJCripps, SJCheng, HHoffman, JESmith, CKupchinsky, SSiu, MTaylor, WDWang, YJohnson, TODress, KREdwards, MPZhou, SHosea, NALapaglia, AKang, PCastro, AErmolieff, JFanjul, AVogel, JERejto, PDalvie, D N-(Pyridin-2-yl) arylsulfonamide inhibitors of 11ß-hydroxysteroid dehydrogenase type 1: strategies to eliminate reactive metabolites. Bioorg Med Chem Lett 23:2344-8 (2013)  
Target
Name:
11-beta-hydroxysteroid dehydrogenase 1
Synonyms:
11-DH 11-beta-Hydroxysteroid Dehydrogenase 1 (11-beta-HSD1) 11-beta-hydroxysteroid dehydrogenase 1 (11HSD1) Corticosteroid 11-beta-dehydrogenase isozyme 1 (11-beta-HSD-1) Corticosteroid 11-beta-dehydrogenase isozyme 1 (11beta-HSD1) HSD11 HSD11L | SDR26C1
Type:
Enzyme
Mol. Mass.:
32409.16
Organism:
Homo sapiens (Human)
Description:
P28845
Residue:
292
  
Inhibitor
Name:
BDBM50432940
Synonyms:
CHEMBL2377205
Type:
Small organic molecule
Emp. Form.:
C20H17N3O2S
Mol. Mass.:
363.433
SMILES:
Cc1cc(C)nc(NS(=O)(=O)c2ccc(cc2)-c2ccc(cc2)C#N)c1
: