Target
Extracellular calcium-sensing receptor
Ligand
BDBM50432973
Substrate
Meas. Tech.
ChEMBL_957699 (CHEMBL2378664)
EC50
30±n/a nM
Citation
 Deprez, PTemal, TJary, HAuberval, MLively, SGuédin, DVevert, JP New potent calcimimetics: II. Discovery of benzothiazole trisubstituted ureas. Bioorg Med Chem Lett 23:2455-9 (2013)  
Target
Name:
Extracellular calcium-sensing receptor
Synonyms:
CASR CaR Calcium-sensing receptor (CaSR) GPRC2A Parathyroid Cell calcium-sensing receptor Synonyms=GPRC2A | hCasR
Type:
Protein
Mol. Mass.:
120663.13
Organism:
Homo sapiens (Human)
Description:
P41180
Residue:
1078
  
Inhibitor
Name:
BDBM50432973
Synonyms:
CHEMBL2377743
Type:
Small organic molecule
Emp. Form.:
C30H35N5O4S2
Mol. Mass.:
593.76
SMILES:
CS(=O)(=O)Nc1ccc2sc(NC(=O)N(CCC(c3ccccc3)c3ccccc3)CCN3CCOCC3)nc2c1
: