Target
Inhibitor of nuclear factor kappa-B kinase subunit beta
Ligand
BDBM28569
Substrate
Meas. Tech.
ChEMBL_957967 (CHEMBL2378059)
IC50
5.0±n/a nM
Citation
 Huang, JJWu, XWJia, JMGuo, XKXue, XJiang, ZYZhang, SLZhang, XJSun, HPYou, QD Novel IKKß inhibitors discovery based on the co-crystal structure by using binding-conformation-based and ligand-based method. Eur J Med Chem 63:269-78 (2013)  
Target
Name:
Inhibitor of nuclear factor kappa-B kinase subunit beta
Synonyms:
I-kappa-B Kinase 2 (IKK-beta) I-kappa-B-kinase beta IKBKB IKK-beta IKK2/IKK1 IKKB_HUMAN Inhibitor of nuclear factor kappa B kinase beta subunit Nuclear factor NF-kappa-B inhibitor kinase beta
Type:
Serine/threonine-protein kinase
Mol. Mass.:
86554.39
Organism:
Homo sapiens (Human)
Description:
GST-tagged IKK-2 was expressed in High Five cells and purified.
Residue:
756
  
Inhibitor
Name:
BDBM28569
Synonyms:
N-({3-[12-methyl-8-(methylamino)-5-thia-3,7,10,12-tetraazatricyclo[7.3.0.0^{2,6}]dodeca-1(9),2(6),3,7,10-pentaen-4-yl]phenyl}methyl)methanesulfonamide | thiazole-based tricyclic inhibitor, 36b
Type:
Small organic molecule
Emp. Form.:
C17H18N6O2S2
Mol. Mass.:
402.494
SMILES:
CNc1nc2sc(nc2c2n(C)cnc12)-c1cccc(CNS(C)(=O)=O)c1
: