Target
P2X purinoceptor 1
Ligand
BDBM50064800
Substrate
Meas. Tech.
ChEMBL_955889 (CHEMBL2379815)
IC50
31±n/a nM
Citation
 Jung, KYCho, JHLee, JSKim, HJKim, YC Synthesis and structure-activity relationships of carboxylic acid derivatives of pyridoxal as P2X receptor antagonists. Bioorg Med Chem 21:2643-50 (2013)  
Target
Name:
P2X purinoceptor 1
Synonyms:
P2RX1_MOUSE | P2rx1
Type:
PROTEIN
Mol. Mass.:
44863.39
Organism:
Mus musculus
Description:
ChEMBL_1280016
Residue:
399
  
Inhibitor
Name:
BDBM50064800
Synonyms:
2-(4-Formyl-5-hydroxy-6-methyl-3-phosphonooxymethyl-pyridin-2-ylazo)-benzene-1,4-disulfonic acid isoPPADS | pyridoxal-alpha5-phosphate-6-azophenyl-2',5'-disulfonic acid
Type:
Small organic molecule
Emp. Form.:
C14H14N3O12PS2
Mol. Mass.:
511.378
SMILES:
Cc1nc(N=Nc2cc(ccc2S(O)(=O)=O)S(O)(=O)=O)c(COP(O)(O)=O)c(C=O)c1O
: