Target
Interleukin-5
Ligand
BDBM50242276
Substrate
Meas. Tech.
ChEMBL_956594 (CHEMBL2380080)
IC50
10600±n/a nM
Citation
 Venkateswararao, ESharma, VKLee, KCRoh, EKim, YJung, SH Design and synthesis of novel chromenone derivatives as interleukin-5 inhibitors. Bioorg Med Chem 21:2543-50 (2013)  
Target
Name:
Interleukin-5
Synonyms:
IL5_MOUSE Il5
Type:
PROTEIN
Mol. Mass.:
15414.97
Organism:
Mus musculus
Description:
ChEMBL_1464308
Residue:
133
  
Inhibitor
Name:
BDBM50242276
Synonyms:
CHEMBL486626 | Sophoricoside
Type:
Small organic molecule
Emp. Form.:
C21H20O10
Mol. Mass.:
432.3775
SMILES:
OC[C@H]1O[C@@H](Oc2ccc(cc2)-c2coc3cc(O)cc(O)c3c2=O)[C@H](O)[C@@H](O)[C@@H]1O
: