Target
Interleukin-5
Ligand
BDBM50433119
Substrate
Meas. Tech.
ChEMBL_956594 (CHEMBL2380080)
IC50
9000±n/a nM
Citation
 Venkateswararao, ESharma, VKLee, KCRoh, EKim, YJung, SH Design and synthesis of novel chromenone derivatives as interleukin-5 inhibitors. Bioorg Med Chem 21:2543-50 (2013)  
Target
Name:
Interleukin-5
Synonyms:
IL5_MOUSE Il5
Type:
PROTEIN
Mol. Mass.:
15414.97
Organism:
Mus musculus
Description:
ChEMBL_1464308
Residue:
133
  
Inhibitor
Name:
BDBM50433119
Synonyms:
CHEMBL2377410
Type:
Small organic molecule
Emp. Form.:
C25H27FO4
Mol. Mass.:
410.4779
SMILES:
OC(CCc1coc2cccc(OCC3CCCCC3)c2c1=O)c1ccc(F)cc1
: