Target
Long-chain fatty acid transport protein 1
Ligand
BDBM50433153
Substrate
Meas. Tech.
ChEMBL_956919 (CHEMBL2378195)
IC50
5400±n/a nM
Citation
 Matsufuji, TIkeda, MNaito, AHirouchi, MKanda, SIzumi, MHarada, JShinozuka, T Arylpiperazines as fatty acid transport protein 1 (FATP1) inhibitors with improved potency and pharmacokinetic properties. Bioorg Med Chem Lett 23:2560-5 (2013)  
Target
Name:
Long-chain fatty acid transport protein 1
Synonyms:
6.2.1.- Fatp Fatty acid transport protein 1 Slc27a1 | Solute carrier family 27 member 1
Type:
PROTEIN
Mol. Mass.:
71289.41
Organism:
Mus musculus
Description:
ChEMBL_956919
Residue:
646
  
Inhibitor
Name:
BDBM50433153
Synonyms:
CHEMBL2377764
Type:
Small organic molecule
Emp. Form.:
C19H23FN4O2
Mol. Mass.:
358.4099
SMILES:
Fc1ccc(cc1)N1CCN(CC(=O)Nc2nc3CCCCc3o2)CC1
: