Target
Tyrosine-protein phosphatase non-receptor type 2
Ligand
BDBM50433165
Substrate
Meas. Tech.
ChEMBL_956929 (CHEMBL2378246)
Ki
8000±n/a nM
Citation
 Chandrasekharappa, APBadiger, SEDubey, PKPanigrahi, SKManukonda, SR Design and synthesis of 2-substituted benzoxazoles as novel PTP1B inhibitors. Bioorg Med Chem Lett 23:2579-84 (2013)  
Target
Name:
Tyrosine-protein phosphatase non-receptor type 2
Synonyms:
PTN2_HUMAN PTPT T-cell protein-tyrosine phosphatase TCPTP Tyrosine-protein phosphatase non-receptor type 2 (TC-PTP)
Type:
Protein
Mol. Mass.:
48481.80
Organism:
Homo sapiens (Human)
Description:
P17706
Residue:
415
  
Inhibitor
Name:
BDBM50433165
Synonyms:
CHEMBL2377802
Type:
Small organic molecule
Emp. Form.:
C24H18F3N3O6S
Mol. Mass.:
533.476
SMILES:
OC(=O)C(=O)Nc1ccc(CC(c2nc3ccccc3o2)S(=O)(=O)Nc2ccc(cc2)C(F)(F)F)cc1
: