Target
Tyrosine-protein phosphatase non-receptor type 2
Ligand
BDBM50433176
Substrate
Meas. Tech.
ChEMBL_956929 (CHEMBL2378246)
Ki
136500±n/a nM
Citation
 Chandrasekharappa, APBadiger, SEDubey, PKPanigrahi, SKManukonda, SR Design and synthesis of 2-substituted benzoxazoles as novel PTP1B inhibitors. Bioorg Med Chem Lett 23:2579-84 (2013)  
Target
Name:
Tyrosine-protein phosphatase non-receptor type 2
Synonyms:
PTN2_HUMAN PTPT T-cell protein-tyrosine phosphatase TCPTP Tyrosine-protein phosphatase non-receptor type 2 (TC-PTP)
Type:
Protein
Mol. Mass.:
48481.80
Organism:
Homo sapiens (Human)
Description:
P17706
Residue:
415
  
Inhibitor
Name:
BDBM50433176
Synonyms:
CHEMBL2375439
Type:
Small organic molecule
Emp. Form.:
C17H15N3O6S
Mol. Mass.:
389.383
SMILES:
NS(=O)(=O)C(Cc1ccc(NC(=O)C(O)=O)cc1)c1nc2ccccc2o1
: