Target
Tyrosine-protein phosphatase non-receptor type 1
Ligand
BDBM50433162
Substrate
Meas. Tech.
ChEMBL_956926 (CHEMBL2378243)
Ki
63000±n/a nM
Citation
 Chandrasekharappa, APBadiger, SEDubey, PKPanigrahi, SKManukonda, SR Design and synthesis of 2-substituted benzoxazoles as novel PTP1B inhibitors. Bioorg Med Chem Lett 23:2579-84 (2013)  
Target
Name:
Tyrosine-protein phosphatase non-receptor type 1
Synonyms:
PTN1_HUMAN PTPN1 Protein tyrosine phosphatase-1B (PTP1B) Protein-tyrosine phosphatase 1B (PTP1B) Tyrosine-protein phosphatase non-receptor type 1 (PTP1B)
Type:
Protein phosphatase
Mol. Mass.:
49963.76
Organism:
Homo sapiens (Human)
Description:
Human recombinant GST-fusion PTP1B (1-435).
Residue:
435
  
Inhibitor
Name:
BDBM50433162
Synonyms:
CHEMBL2377805
Type:
Small organic molecule
Emp. Form.:
C19H17N3O7S
Mol. Mass.:
431.419
SMILES:
CC(=O)NS(=O)(=O)C(Cc1ccc(NC(=O)C(O)=O)cc1)c1nc2ccccc2o1
: