Target
Acyl-CoA wax alcohol acyltransferase 2
Ligand
BDBM50433276
Substrate
Meas. Tech.
ChEMBL_957771 (CHEMBL2378804)
IC50
>100000±n/a nM
Citation
 Barlind, JGBuckett, LKCrosby, SGDavidsson, ÖEmtenäs, HErtan, AJurva, ULemurell, MGutierrez, PMNilsson, KO'Mahony, GPetersson, AURedzic, AWågberg, FYuan, ZQ Identification and design of a novel series of MGAT2 inhibitors. Bioorg Med Chem Lett 23:2721-6 (2013)  
Target
Name:
Acyl-CoA wax alcohol acyltransferase 2
Synonyms:
ARAT AWAT2_HUMAN DC4 Diacylglycerol O-acyltransferase 2-like protein 4 Long-chain-alcohol O-fatty-acyltransferase 2 Multifunctional O-acyltransferase WS hDC4 | hWS
Type:
PROTEIN
Mol. Mass.:
38111.73
Organism:
Homo sapiens (Human)
Description:
ChEMBL_107584
Residue:
333
  
Inhibitor
Name:
BDBM50433276
Synonyms:
CHEMBL2376316
Type:
Small organic molecule
Emp. Form.:
C19H21F2N3O3S
Mol. Mass.:
409.45
SMILES:
CCC1(CC)CNc2ccc(cc2C(=O)N1)S(=O)(=O)Nc1ccc(F)cc1F
: