Target
Cholinesterase
Ligand
BDBM50433318
Substrate
Meas. Tech.
ChEMBL_957894 (CHEMBL2377919)
IC50
1.000000±n/a nM
Citation
 Chen, YSun, JHuang, ZLiao, HPeng, SLehmann, JZhang, Y Design, synthesis and evaluation of tacrine-flurbiprofen-nitrate trihybrids as novel anti-Alzheimer's disease agents. Bioorg Med Chem 21:2462-70 (2013)  
Target
Name:
Cholinesterase
Synonyms:
BCHE CHLE_HORSE | Cholinesterase
Type:
Enzyme
Mol. Mass.:
65643.35
Organism:
Equus caballus (Horse)
Description:
P81908
Residue:
574
  
Inhibitor
Name:
BDBM50433318
Synonyms:
CHEMBL2376478
Type:
Small organic molecule
Emp. Form.:
C38H45FN4O5
Mol. Mass.:
656.7861
SMILES:
CC(C(=O)NCCCCCCCCNc1c2CCCCc2nc2ccccc12)c1ccc(c(F)c1)-c1ccc(OCCO[N+]([O-])=O)cc1
: