Target
Cholinesterase
Ligand
BDBM50433319
Substrate
Meas. Tech.
ChEMBL_957894 (CHEMBL2377919)
IC50
0.600000±n/a nM
Citation
 Chen, YSun, JHuang, ZLiao, HPeng, SLehmann, JZhang, Y Design, synthesis and evaluation of tacrine-flurbiprofen-nitrate trihybrids as novel anti-Alzheimer's disease agents. Bioorg Med Chem 21:2462-70 (2013)  
Target
Name:
Cholinesterase
Synonyms:
BCHE CHLE_HORSE | Cholinesterase
Type:
Enzyme
Mol. Mass.:
65643.35
Organism:
Equus caballus (Horse)
Description:
P81908
Residue:
574
  
Inhibitor
Name:
BDBM50433319
Synonyms:
CHEMBL2376477
Type:
Small organic molecule
Emp. Form.:
C40H49FN4O5
Mol. Mass.:
684.8393
SMILES:
CC(C(=O)NCCCCCCNc1c2CCCCc2nc2ccccc12)c1ccc(c(F)c1)-c1ccc(OCCCCCCO[N+]([O-])=O)cc1
: