Target
Cyclin-dependent kinase 5 activator 1
Ligand
BDBM50433369
Substrate
Meas. Tech.
ChEMBL_956652 (CHEMBL2380179)
IC50
1.5±n/a nM
Citation
 Schonbrunn, EBetzi, SAlam, RMartin, MPBecker, AHan, HFrancis, RChakrasali, RJakkaraj, SKazi, ASebti, SMCubitt, CLGebhard, AWHazlehurst, LATash, JSGeorg, GI Development of highly potent and selective diaminothiazole inhibitors of cyclin-dependent kinases. J Med Chem 56:3768-82 (2013)  
Target
Name:
Cyclin-dependent kinase 5 activator 1
Synonyms:
CDK5/p35 Cyclin-dependent kinase 5 regulatory subunit 1 | Cyclin-dependent kinase 5/CDK5 activator 1
Type:
Protein Complex
Mol. Mass.:
Description:
Components:
This complex has 2 components.
Component 1
Name:
Cyclin-dependent kinase 5
Synonyms:
CDK5 CDKN5 Cyclin-dependent kinase 5 (CDK5/ p25) Cyclin-dependent-like kinase 5 PSSALRE Tau protein kinase II catalytic subunit
Type:
Enzyme Subunit
Mol. Mass.:
33308.61
Organism:
Homo sapiens (Human)
Description:
Residue:
292
  
Component 2
Name:
Cyclin-dependent kinase 5 activator 1
Synonyms:
CD5R1_HUMAN CDK5R1 Cyclin-dependent kinase 5 (CDK5/p25) NCK5A p35
Type:
Enzyme Subunit
Mol. Mass.:
34077.43
Organism:
Homo sapiens (Human)
Description:
Q15078
Residue:
307
  
Inhibitor
Name:
BDBM50433369
Synonyms:
CHEMBL2377825
Type:
Small organic molecule
Emp. Form.:
C16H13N5O5S2
Mol. Mass.:
419.435
SMILES:
Nc1nc(Nc2ccc(cc2)S(N)(=O)=O)sc1C(=O)c1ccccc1[N+]([O-])=O
: