Target
Methionine aminopeptidase 1
Ligand
BDBM50042874
Substrate
Meas. Tech.
ChEMBL_957175 (CHEMBL2378713)
EC50
320±n/a nM
Citation
 Zhang, FBhat, SGabelli, SBChen, XMiller, MSNacev, BACheng, YLMeyers, DJTenney, KShim, JSCrews, PAmzel, LMMa, DLiu, JO Pyridinylquinazolines selectively inhibit human methionine aminopeptidase-1 in cells. J Med Chem 56:3996-4016 (2013)  
Target
Name:
Methionine aminopeptidase 1
Synonyms:
Aminopeptidase MAP 1 METAP1 Methionine Aminopeptidase Type 1 (MetAP1) | Peptidase M 1
Type:
Enzyme
Mol. Mass.:
43220.79
Organism:
Homo sapiens (Human)
Description:
MetAP1 with an N-terminal six histidine tag was expressed in baculovirus infected sf9 cells.
Residue:
386
  
Inhibitor
Name:
BDBM50042874
Synonyms:
2,2'-Bipyridin 2,2'-bipyridyl 2,2'-dipyridyl CHEMBL39879 alpha,alpha'-bipyridine alpha,alpha'-dipyridine bpy
Type:
Small organic molecule
Emp. Form.:
C10H8N2
Mol. Mass.:
156.1839
SMILES:
c1ccc(nc1)-c1ccccn1
: