Target
Transcriptional activator Myb
Ligand
BDBM50433458
Substrate
Meas. Tech.
ChEMBL_958516 (CHEMBL2383288)
IC50
1795±n/a nM
Citation
 Schomburg, CSchuehly, WDa Costa, FBKlempnauer, KHSchmidt, TJ Natural sesquiterpene lactones as inhibitors of Myb-dependent gene expression: structure-activity relationships. Eur J Med Chem 63:313-20 (2013)  
Target
Name:
Transcriptional activator Myb
Synonyms:
MYB Proto-oncogene c-Myb
Type:
PROTEIN
Mol. Mass.:
72474.34
Organism:
Gallus gallus
Description:
ChEMBL_107588
Residue:
641
  
Inhibitor
Name:
BDBM50433458
Synonyms:
MEXICANIN I
Type:
Small organic molecule
Emp. Form.:
C15H18O4
Mol. Mass.:
262.301
SMILES:
C[C@@H]1C[C@@H]2OC(=O)C(=C)[C@H]2[C@@H](O)[C@@]2(C)[C@H]1C=CC2=O
: