Target
Transcriptional activator Myb
Ligand
BDBM50433420
Substrate
Meas. Tech.
ChEMBL_958516 (CHEMBL2383288)
IC50
2210±n/a nM
Citation
 Schomburg, CSchuehly, WDa Costa, FBKlempnauer, KHSchmidt, TJ Natural sesquiterpene lactones as inhibitors of Myb-dependent gene expression: structure-activity relationships. Eur J Med Chem 63:313-20 (2013)  
Target
Name:
Transcriptional activator Myb
Synonyms:
MYB Proto-oncogene c-Myb
Type:
PROTEIN
Mol. Mass.:
72474.34
Organism:
Gallus gallus
Description:
ChEMBL_107588
Residue:
641
  
Inhibitor
Name:
BDBM50433420
Synonyms:
CHEMBL2380786
Type:
Small organic molecule
Emp. Form.:
C19H20O6
Mol. Mass.:
344.3585
SMILES:
CC(=C)C(=O)O[C@@H]1C[C@@]2(C)OC(=CC2=O)C(=C)C[C@H]2OC(=O)C(=C)[C@H]12
: