Target
Transcriptional activator Myb
Ligand
BDBM50433439
Substrate
Meas. Tech.
ChEMBL_958516 (CHEMBL2383288)
IC50
14350±n/a nM
Citation
 Schomburg, CSchuehly, WDa Costa, FBKlempnauer, KHSchmidt, TJ Natural sesquiterpene lactones as inhibitors of Myb-dependent gene expression: structure-activity relationships. Eur J Med Chem 63:313-20 (2013)  
Target
Name:
Transcriptional activator Myb
Synonyms:
MYB Proto-oncogene c-Myb
Type:
PROTEIN
Mol. Mass.:
72474.34
Organism:
Gallus gallus
Description:
ChEMBL_107588
Residue:
641
  
Inhibitor
Name:
BDBM50433439
Synonyms:
CHEMBL453565
Type:
Small organic molecule
Emp. Form.:
C20H28O6
Mol. Mass.:
364.4327
SMILES:
CC(O)C(C)C(=O)O[C@H]1C[C@@H]2[C@H](OC(=O)C2=C)[C@H]2O[C@]2(C)CCC=C1C
: