Target
Transcriptional activator Myb
Ligand
BDBM50433469
Substrate
Meas. Tech.
ChEMBL_958516 (CHEMBL2383288)
IC50
2540±n/a nM
Citation
 Schomburg, CSchuehly, WDa Costa, FBKlempnauer, KHSchmidt, TJ Natural sesquiterpene lactones as inhibitors of Myb-dependent gene expression: structure-activity relationships. Eur J Med Chem 63:313-20 (2013)  
Target
Name:
Transcriptional activator Myb
Synonyms:
MYB Proto-oncogene c-Myb
Type:
PROTEIN
Mol. Mass.:
72474.34
Organism:
Gallus gallus
Description:
ChEMBL_107588
Residue:
641
  
Inhibitor
Name:
BDBM50433469
Synonyms:
6-O-Isobutyrylhelenalin | HELENALINISOBUTYRATE
Type:
Small organic molecule
Emp. Form.:
C19H24O5
Mol. Mass.:
332.3909
SMILES:
CC(C)C(=O)O[C@H]1[C@H]2[C@@H](C[C@@H](C)[C@@H]3C=CC(=O)[C@@]13C)OC(=O)C2=C
: