Target
Phosphatidylinositol 4,5-bisphosphate 3-kinase catalytic subunit gamma isoform
Ligand
BDBM50433545
Substrate
Meas. Tech.
ChEMBL_959696 (CHEMBL2383016)
IC50
0.600000±n/a nM
Citation
 Staben, STNdubaku, CBlaquiere, NBelvin, MBull, RJDudley, DEdgar, KGray, DHeald, RHeffron, TPJones, GEJones, MKolesnikov, ALee, LLesnick, JLewis, CMurray, JMcLean, NJNonomiya, JOlivero, AGOrd, RPang, JPrice, SPrior, WWRouge, LSalphati, LSampath, DWallin, JWang, LWei, BWeismann, CWu, P Discovery of thiazolobenzoxepin PI3-kinase inhibitors that spare the PI3-kinaseß isoform. Bioorg Med Chem Lett 23:2606-13 (2013)  
Target
Name:
Phosphatidylinositol 4,5-bisphosphate 3-kinase catalytic subunit gamma isoform
Synonyms:
PI3-kinase p110 subunit gamma PI3Kgamma PK3CG_HUMAN Phosphatidylinositol 4,5-bisphosphate 3-kinase (PI3K) Phosphatidylinositol 4,5-bisphosphate 3-kinase catalytic subunit gamma (PI3Kgamma) Phosphatidylinositol 4,5-bisphosphate 3-kinase catalytic subunit gamma isoform (PI3K) Phosphatidylinositol-4,5-bisphosphate 3-kinase catalytic subunit gamma isoform Phosphoinositide 3-kinases gamma (PI3K gamma) p120-PI3K
Type:
Enzyme Subunit
Mol. Mass.:
126470.30
Organism:
Homo sapiens (Human)
Description:
P48736
Residue:
1102
  
Inhibitor
Name:
BDBM50433545
Synonyms:
CHEMBL2381271
Type:
Small organic molecule
Emp. Form.:
C20H20N6OS
Mol. Mass.:
392.477
SMILES:
CC(C)n1ncnc1-c1nc-2c(CCOc3cc(ccc-23)-c2cn(C)cn2)s1
: