Target
E3 ubiquitin-protein ligase Mdm2
Ligand
BDBM50392531
Substrate
Meas. Tech.
ChEMBL_959852 (CHEMBL2383516)
IC50
100±n/a nM
Citation
 Carry, JCGarcia-Echeverria, C Inhibitors of the p53/hdm2 protein-protein interaction-path to the clinic. Bioorg Med Chem Lett 23:2480-5 (2013)  
Target
Name:
E3 ubiquitin-protein ligase Mdm2
Synonyms:
Double minute 2 protein E3 ubiquitin-protein ligase Mdm2 (p53-binding protein Mdm2) Human Double Minute 2 (HDM2) MDM2-MDMX p53-Binding Protein MDM2 | p53-binding protein
Type:
Oncoprotein
Mol. Mass.:
55196.54
Organism:
Homo sapiens (Human)
Description:
Q00987
Residue:
491
  
Inhibitor
Name:
BDBM50392531
Synonyms:
CHEMBL407632
Type:
Small organic molecule
Emp. Form.:
C31H34Br2N4O4
Mol. Mass.:
686.434
SMILES:
CCOc1cc(OC)ccc1C1=N[C@H]([C@H](N1C(=O)N1CCN(CCO)CC1)c1ccc(Br)cc1)c1ccc(Br)cc1
: