Target
Glucagon receptor
Ligand
BDBM50433589
Substrate
Meas. Tech.
ChEMBL_960258 (CHEMBL2382751)
Ki
170±n/a nM
Citation
 Guzman-Perez, APfefferkorn, JALee, ECStevens, BDAspnes, GEBian, JDidiuk, MTFilipski, KJMoore, DPerreault, CSammons, MFTu, MBrown, JAtkinson, KLitchfield, JTan, BSamas, BZavadoski, WJSalatto, CTTreadway, J The design and synthesis of a potent glucagon receptor antagonist with favorable physicochemical and pharmacokinetic properties as a candidate for the treatment of type 2 diabetes mellitus. Bioorg Med Chem Lett 23:3051-8 (2013)  
Target
Name:
Glucagon receptor
Synonyms:
GCGR GLR_HUMAN Glucagon receptor (GlucR)
Type:
Enzyme
Mol. Mass.:
54026.92
Organism:
Homo sapiens (Human)
Description:
P47871
Residue:
477
  
Inhibitor
Name:
BDBM50433589
Synonyms:
CHEMBL2381834
Type:
Small organic molecule
Emp. Form.:
C25H26F3N3O4
Mol. Mass.:
489.4868
SMILES:
CC(C)(C)C(Oc1ccc(cc1)-n1cc(cn1)C(F)(F)F)c1ccc(cc1)C(=O)NCCC(O)=O
: