Target
Tyrosine-protein kinase JAK2
Ligand
BDBM50433601
Substrate
Meas. Tech.
ChEMBL_958068 (CHEMBL2383938)
IC50
3.0±n/a nM
Citation
 Guan, HLamb, MLPeng, BHuang, SDegrace, NRead, JHussain, SWu, JRivard, CAlimzhanov, MBebernitz, GBell, KYe, MZinda, MIoannidis, S Discovery of novel Jak2-Stat pathway inhibitors with extended residence time on target. Bioorg Med Chem Lett 23:3105-10 (2013)  
Target
Name:
Tyrosine-protein kinase JAK2
Synonyms:
JAK-2 JAK2_HUMAN Janus kinase 2 (JAK2) | Janus kinase 2 (a protein tyrosine kinase)
Type:
Protein
Mol. Mass.:
130684.68
Organism:
Homo sapiens (Human)
Description:
O60674
Residue:
1132
  
Inhibitor
Name:
BDBM50433601
Synonyms:
CHEMBL2381983
Type:
Small organic molecule
Emp. Form.:
C19H21F3N8O
Mol. Mass.:
434.4182
SMILES:
C[C@H](Nc1nc(Nc2cc(C)n[nH]2)nc(N2CCOCC2)c1F)c1ncc(F)cc1F
: