Target
Aurora kinase B
Ligand
BDBM50433648
Substrate
Meas. Tech.
ChEMBL_959027 (CHEMBL2382840)
IC50
174±n/a nM
Citation
 Karra, SXiao, YChen, XLiu-Bujalski, LHuck, BSutton, AGoutopoulos, AAskew, BJosephson, KJiang, XShutes, AShankar, VNoonan, TGarcia-Berrios, GDong, RDhanabal, MTian, HWang, ZClark, AGoodstal, S SAR and evaluation of novel 5H-benzo[c][1,8]naphthyridin-6-one analogs as Aurora kinase inhibitors. Bioorg Med Chem Lett 23:3081-7 (2013)  
Target
Name:
Aurora kinase B
Synonyms:
AIK2 AIM1 ARK2 AURKB_HUMAN Aurora B-INCENP Aurora kinase B (AURKB) STK-1 STK12 Serine/threonine-protein kinase aurora B
Type:
Protein
Mol. Mass.:
39327.72
Organism:
Homo sapiens (Human)
Description:
Q96GD4
Residue:
344
  
Inhibitor
Name:
BDBM50433648
Synonyms:
CHEMBL2380843
Type:
Small organic molecule
Emp. Form.:
C18H14N4O
Mol. Mass.:
302.33
SMILES:
Nc1ccc(Nc2ccnc3[nH]c(=O)c4ccccc4c23)cc1
: