Target
Acetylcholinesterase
Ligand
BDBM50433753
Substrate
Meas. Tech.
ChEMBL_959732 (CHEMBL2383184)
IC50
9100±n/a nM
Citation
 Arunkhamkaew, SAthipornchai, AApiratikul, NSuksamrarn, AAjavakom, V Novel racemic tetrahydrocurcuminoid dihydropyrimidinone analogues as potent acetylcholinesterase inhibitors. Bioorg Med Chem Lett 23:2880-2 (2013)  
Target
Name:
Acetylcholinesterase
Synonyms:
ACES_ELEEL Acetylcholinesterase (EeAChE) | ache
Type:
Enzyme
Mol. Mass.:
71812.79
Organism:
Electrophorus electricus (Electric eel)
Description:
Residue:
633
  
Inhibitor
Name:
BDBM50433753
Synonyms:
CHEMBL2381441
Type:
Small organic molecule
Emp. Form.:
C29H30N2O6
Mol. Mass.:
502.5583
SMILES:
COc1ccc(cc1)C1NC(=O)N=C(CCc2ccc(O)c(OC)c2)C1C(=O)CCc1ccc(O)cc1
: