Target
Dual specificity protein kinase TTK
Ligand
BDBM50386816
Substrate
Meas. Tech.
ChEMBL_959809 (CHEMBL2383381)
IC50
1.8±n/a nM
Citation
 Kusakabe, KIde, NDaigo, YTachibana, YItoh, TYamamoto, THashizume, HHato, YHigashino, KOkano, YSato, YInoue, MIguchi, MKanazawa, TIshioka, YDohi, KKido, YSakamoto, SYasuo, KMaeda, MHigaki, MUeda, KYoshizawa, HBaba, YShiota, TMurai, HNakamura, Y Indazole-based potent and cell-active Mps1 kinase inhibitors: rational design from pan-kinase inhibitor anthrapyrazolone (SP600125). J Med Chem 56:4343-56 (2013)  
Target
Name:
Dual specificity protein kinase TTK
Synonyms:
Dual specificity protein kinase (TTK) MPS1 Monopolar Spindle 1 (MPS1) Monopolar Spindle 1 Kinase (MPS1) TTK | TTK_HUMAN
Type:
Protein
Mol. Mass.:
97086.79
Organism:
Homo sapiens (Human)
Description:
P33981
Residue:
857
  
Inhibitor
Name:
BDBM50386816
Synonyms:
CHEMBL2047943
Type:
Small organic molecule
Emp. Form.:
C22H29N7O
Mol. Mass.:
407.512
SMILES:
Cc1cc(ccc1Nc1nc(NC2CCCCC2)c2[nH]cnc2n1)N1CCOCC1
: