Target
Caspase-7
Ligand
BDBM50434076
Substrate
Meas. Tech.
ChEMBL_958427 (CHEMBL2382935)
IC50
0.951000±n/a nM
Citation
 Limpachayaporn, PWagner, SKopka, KHermann, SSchäfers, MHaufe, G Synthesis, 18F-radiolabeling, and in vivo biodistribution studies of N-fluorohydroxybutyl isatin sulfonamides using positron emission tomography. J Med Chem 56:4509-20 (2013)  
Target
Name:
Caspase-7
Synonyms:
Apoptotic protease Mch-3 CASP7 CMH-1 MCH3 | caspase 7, apoptosis-related cysteine peptidase
Type:
Enzyme
Mol. Mass.:
34273.91
Organism:
Homo sapiens (Human)
Description:
P55210
Residue:
303
  
Inhibitor
Name:
BDBM50434076
Synonyms:
CHEMBL2381343
Type:
Small organic molecule
Emp. Form.:
C18H23FN2O6S
Mol. Mass.:
414.448
SMILES:
COC[C@@H]1CCCN1S(=O)(=O)c1ccc2N(CC[C@H](F)CO)C(=O)C(=O)c2c1
: