Target
Chymase
Ligand
BDBM50434114
Substrate
Meas. Tech.
ChEMBL_958460 (CHEMBL2383101)
IC50
340000±n/a nM
Citation
 Taylor, SJPadyana, AKAbeywardane, ALiang, SHao, MHDe Lombaert, SProudfoot, JFarmer, BSLi, XCollins, BMartin, LAlbaugh, DRHill-Drzewi, MPullen, SSTakahashi, H Discovery of potent, selective chymase inhibitors via fragment linking strategies. J Med Chem 56:4465-81 (2013)  
Target
Name:
Chymase
Synonyms:
Alpha-chymase CMA1_HUMAN CYM Mast cell protease I
Type:
Enzyme
Mol. Mass.:
27340.12
Organism:
Homo sapiens (Human)
Description:
Residue:
247
  
Inhibitor
Name:
BDBM50434114
Synonyms:
CHEMBL511085
Type:
Small organic molecule
Emp. Form.:
C8H6ClN
Mol. Mass.:
151.593
SMILES:
Clc1ccc2cc[nH]c2c1
: