Target
Chymase
Ligand
BDBM50434115
Substrate
Meas. Tech.
ChEMBL_958460 (CHEMBL2383101)
IC50
>1000000±n/a nM
Citation
 Taylor, SJPadyana, AKAbeywardane, ALiang, SHao, MHDe Lombaert, SProudfoot, JFarmer, BSLi, XCollins, BMartin, LAlbaugh, DRHill-Drzewi, MPullen, SSTakahashi, H Discovery of potent, selective chymase inhibitors via fragment linking strategies. J Med Chem 56:4465-81 (2013)  
Target
Name:
Chymase
Synonyms:
Alpha-chymase CMA1_HUMAN CYM Mast cell protease I
Type:
Enzyme
Mol. Mass.:
27340.12
Organism:
Homo sapiens (Human)
Description:
Residue:
247
  
Inhibitor
Name:
BDBM50434115
Synonyms:
CHEMBL2381490
Type:
Small organic molecule
Emp. Form.:
C9H8ClNO
Mol. Mass.:
181.619
SMILES:
CN1C(=O)Cc2ccc(Cl)cc12
: