Target
Metabotropic glutamate receptor 8
Ligand
BDBM50434131
Substrate
Meas. Tech.
ChEMBL_958945 (CHEMBL2382523)
EC50
12400±n/a nM
Citation
 Monn, JAValli, MJMassey, SMHao, JReinhard, MRBures, MGHeinz, BAWang, XCarter, JHGetman, BGStephenson, GAHerin, MCatlow, JTSwanson, SJohnson, BGMcKinzie, DLHenry, SS Synthesis and pharmacological characterization of 4-substituted-2-aminobicyclo[3.1.0]hexane-2,6-dicarboxylates: identification of new potent and selective metabotropic glutamate 2/3 receptor agonists. J Med Chem 56:4442-55 (2013)  
Target
Name:
Metabotropic glutamate receptor 8
Synonyms:
GPRC1H GRM8_HUMAN Metabotropic glutamate receptor 8 | metabotropic glutamate 8
Type:
Enzyme Catalytic Domain
Mol. Mass.:
101759.58
Organism:
Homo sapiens (Human)
Description:
metabotropic glutamate 8 GRM8 HUMAN::O00222
Residue:
908
  
Inhibitor
Name:
BDBM50434131
Synonyms:
CHEMBL2381644
Type:
Small organic molecule
Emp. Form.:
C8H10N4O4
Mol. Mass.:
226.1894
SMILES:
N[C@]1(C[C@@H](N=[N+]=[N-])[C@H]2[C@@H]([C@@H]12)C(O)=O)C(O)=O
: