Target
Prostate-specific antigen
Ligand
BDBM50434147
Substrate
Meas. Tech.
ChEMBL_959198 (CHEMBL2383481)
Ki
61±n/a nM
Citation
 Kostova, MBRosen, DMChen, YMease, RCDenmeade, SR Structural optimization, biological evaluation, and application of peptidomimetic prostate specific antigen inhibitors. J Med Chem 56:4224-35 (2013)  
Target
Name:
Prostate-specific antigen
Synonyms:
APS KLK3 Kallikrein-3 PSA Prostate-specific antigen Seminin
Type:
PROTEIN
Mol. Mass.:
28747.53
Organism:
Homo sapiens (Human)
Description:
ChEMBL_959198
Residue:
261
  
Inhibitor
Name:
BDBM50434147
Synonyms:
CHEMBL2381661
Type:
Small organic molecule
Emp. Form.:
C37H56BN7O9
Mol. Mass.:
753.693
SMILES:
CCCC[C@H](NC(=O)[C@H](CCC(N)=O)NC(=O)[C@H](CO)NC(=O)[C@H](Cc1ccccc1)NC(=O)CCCCCN)C(=O)N[C@H](Cc1ccccc1)B(O)O
: