Target
Prostate-specific antigen
Ligand
BDBM50434148
Substrate
Meas. Tech.
ChEMBL_959198 (CHEMBL2383481)
Ki
52±n/a nM
Citation
 Kostova, MBRosen, DMChen, YMease, RCDenmeade, SR Structural optimization, biological evaluation, and application of peptidomimetic prostate specific antigen inhibitors. J Med Chem 56:4224-35 (2013)  
Target
Name:
Prostate-specific antigen
Synonyms:
APS KLK3 Kallikrein-3 PSA Prostate-specific antigen Seminin
Type:
PROTEIN
Mol. Mass.:
28747.53
Organism:
Homo sapiens (Human)
Description:
ChEMBL_959198
Residue:
261
  
Inhibitor
Name:
BDBM50434148
Synonyms:
CHEMBL2381663
Type:
Small organic molecule
Emp. Form.:
C27H51BBrN7O9
Mol. Mass.:
708.45
SMILES:
CCCC[C@H](NC(=O)[C@H](CCC(N)=O)NC(=O)[C@H](CO)NC(=O)[C@H](C)NC(=O)CCCCCN)C(=O)N[C@H](CCCBr)B(O)O
: