Target
Prolyl endopeptidase FAP
Ligand
BDBM50434161
Substrate
Meas. Tech.
ChEMBL_960574 (CHEMBL2389863)
IC50
370±n/a nM
Citation
 Jansen, KHeirbaut, LCheng, JDJoossens, JRyabtsova, OCos, PMaes, LLambeir, AMDe Meester, IAugustyns, KVan der Veken, P Selective Inhibitors of Fibroblast Activation Protein (FAP) with a (4-Quinolinoyl)-glycyl-2-cyanopyrrolidine Scaffold. ACS Med Chem Lett 4:491-6 (2013)  
Target
Name:
Prolyl endopeptidase FAP
Synonyms:
Fap SEPR_MOUSE | Seprase
Type:
Enzyme
Mol. Mass.:
87949.14
Organism:
Mus musculus (Mouse)
Description:
P97321
Residue:
761
  
Inhibitor
Name:
BDBM50434161
Synonyms:
CHEMBL2385275 | US9346814, Cmpd No 10 Example 13
Type:
Small organic molecule
Emp. Form.:
C17H15BrN4O2
Mol. Mass.:
387.231
SMILES:
Brc1cccc2c(ccnc12)C(=O)NCC(=O)N1CCC[C@H]1C#N
: