Target
Matrilysin
Ligand
BDBM50434217
Substrate
Meas. Tech.
ChEMBL_960926 (CHEMBL2388544)
Ki
4000±n/a nM
Citation
 Mori, MMassaro, ACalderone, VFragai, MLuchinat, CMordini, A Discovery of a New Class of Potent MMP Inhibitors by Structure-Based Optimization of the Arylsulfonamide Scaffold. ACS Med Chem Lett 4:565-9 (2013)  
Target
Name:
Matrilysin
Synonyms:
MMP7 MPSL1 Matrix metalloproteinase-7 (MMP-7) PUMP1
Type:
Enzyme
Mol. Mass.:
29681.54
Organism:
Homo sapiens (Human)
Description:
P09237
Residue:
267
  
Inhibitor
Name:
BDBM50434217
Synonyms:
CHEMBL2385479
Type:
Small organic molecule
Emp. Form.:
C8H10N2O4S
Mol. Mass.:
230.241
SMILES:
ONC(=O)CNS(=O)(=O)c1ccccc1
: