Target
E3 ubiquitin-protein ligase Mdm2
Ligand
BDBM50434288
Substrate
Meas. Tech.
ChEMBL_961694 (CHEMBL2389364)
IC50
26±n/a nM
Citation
 Vu, BWovkulich, PPizzolato, GLovey, ADing, QJiang, NLiu, JJZhao, CGlenn, KWen, YTovar, CPackman, KVassilev, LGraves, B Discovery of RG7112: A Small-Molecule MDM2 Inhibitor in Clinical Development. ACS Med Chem Lett 4:466-9 (2013)  
Target
Name:
E3 ubiquitin-protein ligase Mdm2
Synonyms:
Double minute 2 protein E3 ubiquitin-protein ligase Mdm2 (p53-binding protein Mdm2) Human Double Minute 2 (HDM2) MDM2-MDMX p53-Binding Protein MDM2 | p53-binding protein
Type:
Oncoprotein
Mol. Mass.:
55196.54
Organism:
Homo sapiens (Human)
Description:
Q00987
Residue:
491
  
Inhibitor
Name:
BDBM50434288
Synonyms:
CHEMBL2386345
Type:
Small organic molecule
Emp. Form.:
C36H44Cl2N4O3
Mol. Mass.:
651.666
SMILES:
CCOc1cc(ccc1C1=N[C@@](C)(c2ccc(Cl)cc2)[C@](C)(N1C(=O)N1CCN(CCO)CC1)c1ccc(Cl)cc1)C(C)(C)C
: