Target
Free fatty acid receptor 1
Ligand
BDBM50434295
Substrate
Meas. Tech.
ChEMBL_961970 (CHEMBL2390711)
EC50
148±n/a nM
Citation
 Christiansen, EHansen, SVUrban, CHudson, BDWargent, ETGrundmann, MJenkins, LZaibi, MStocker, CJUllrich, SKostenis, EKassack, MUMilligan, GCawthorne, MAUlven, T Discovery of TUG-770: A Highly Potent Free Fatty Acid Receptor 1 (FFA1/GPR40) Agonist for Treatment of Type 2 Diabetes. ACS Med Chem Lett 4:441-445 (2013)  
Target
Name:
Free fatty acid receptor 1
Synonyms:
FFAR1_MOUSE Gpr40
Type:
PROTEIN
Mol. Mass.:
31818.80
Organism:
Mus musculus
Description:
ChEMBL_1454431
Residue:
300
  
Inhibitor
Name:
BDBM50434295
Synonyms:
CHEMBL2386353
Type:
Small organic molecule
Emp. Form.:
C19H14FNO2
Mol. Mass.:
307.3184
SMILES:
OC(=O)CCc1ccc(cc1F)C#Cc1ccccc1CC#N
: