Target
Serine/threonine-protein kinase PAK 2
Ligand
BDBM50434331
Substrate
Meas. Tech.
ChEMBL_960988 (CHEMBL2388904)
IC50
71±n/a nM
Citation
 Abdel-Magid, AF PAK1: A Therapeutic Target for Cancer Treatment. ACS Med Chem Lett 4:431-2 (2013)  
Target
Name:
Serine/threonine-protein kinase PAK 2
Synonyms:
PAK2 Serine/threonine-protein kinase PAK 1/PAK 2/PAK 3 Serine/threonine-protein kinase PAK 2 (PAK2) | p21-Activated kinase 2 (PAK2)
Type:
Enzyme
Mol. Mass.:
58037.40
Organism:
Homo sapiens (Human)
Description:
Q13177
Residue:
524
  
Inhibitor
Name:
BDBM50434331
Synonyms:
CHEMBL2386717
Type:
Small organic molecule
Emp. Form.:
C21H23FN8O
Mol. Mass.:
422.4587
SMILES:
CC(CO)N(Cc1cc(F)cc2[nH]ncc12)c1nccc(Nc2cc(n[nH]2)C2CC2)n1
: